released_key,Age ( 6 months or less),Age (>6 months),Anaemia,Cerebral Malaria,Cerebral Malaria (BCS < 3),Cerebral Malaria (BCS <= 3),Cerebral Malaria (BCS = 3),Control,Died,Female,hypoglycemia,Male,Parasites Present,Severe Malaria Anaemia (5 <= Hb < 6),Severe Malaria Anaemia (Hb < 5),ethnicity,location
100051977,,1,,,,,,,,1,,,1,,,FAN,Dallau
100164256,,1,,,,,,,,,,1,,,,FAN,Dallau
100227748,,1,,,,,,,,1,,,,,,FAN,Dallau
100249164,,1,,,,,,,,,,1,1,,,PAN,Dallau
100265634,,1,,,,,,,,1,,,1,,,FAN,Dallau
100352101,,1,,,,,,,,,,1,1,,,PAN,Dallau
100456287,,1,,,,,,,,,,1,1,,,WAN,Dallau
100507085,,1,,1,1,1,,,,,,1,1,,,FAN,Dallau
100771785,1,,,,,,,,,,,1,1,,,FAN,Monnau
100795524,,1,,,,,,,,,,1,,,,FAN,Monnau
100992413,,1,,,,,,,,1,,,,,,FAN,Monnau
101038283,,1,,1,1,1,,,,1,,,1,,,FAN,Pindau
101097322,,1,,,,,,,,,,1,,,,FAN,Pindau
101337118,,1,,,,,,,,1,,,,,,FAN,Pindau
101340713,,1,,1,,1,1,,,1,,,1,,,WAN,Findau
101351573,,1,,,,,,,,,,1,,,,WAN,Findau
101365408,,1,,,,,,,,1,,,,,,WAN,Findau
101406090,,1,,1,1,1,,,,1,1,,1,,,CAN,Balau
101522069,,1,,,,,,,,,,1,,,,CAN,Balau
101876766,,1,,,,,,,,1,,,,,,CAN,Balau
101953642,1,,,1,1,1,,,,,1,1,1,,,FAN,Balau
102407785,,1,,,,,,,,,,1,,,,FAN,Balau
102440055,,1,,,,,,,,1,,,,,,FAN,Balau
102489482,,1,,1,1,1,,,,,,1,1,,,PAN,Dallau
102542372,,1,,,,,,,,,,1,,,,PAN,Dallau
102655766,,1,,,,,,,,1,,,,,,PAN,Dallau
102888447,,1,,1,1,1,,,,,,1,1,,,FAN,Findau
102954721,,1,,,,,,,,,,1,,,,FAN,Findau
103206176,,1,,,,,,,,1,,,,,,FAN,Findau
103285917,,1,,1,1,1,,,,1,1,,1,,,CAN,Findau
103344741,,1,,,,,,,,,,1,,,,CAN,Findau
103368303,,1,,,,,,,,1,,,,,,CAN,Findau
103421049,,1,,1,1,1,,,,,1,1,1,,,CAN,Pindau
103474092,,1,,,,,,,,,,1,,,,CAN,Pindau
103617857,,1,,,,,,,,1,,,,,,CAN,Pindau
103687006,,1,,1,1,1,,,1,1,,,1,,,JAN,Pindau
103950433,,1,,,,,,,,,,1,,,,JAN,Pindau
104118106,,1,,,,,,,,1,,,,,,JAN,Pindau
104137597,,1,,1,1,1,,,1,1,,,1,,,CAN,Dallau
104269807,,1,,,,,,,,,,1,,,,CAN,Dallau
104280038,,1,,,,,,,,1,,,,,,CAN,Dallau
104480851,,1,,1,1,1,,,,1,,,1,,,CAN,Balau
104500961,,1,,,,,,,,1,1,,1,,,CAN,Findau
104524442,,1,,,,,,,,,,1,,,,CAN,Findau
104551957,,1,,,,,,,,1,,,,,,CAN,Findau
104597606,,1,,1,1,1,,,,1,,,1,,,JAN,Monnau
104603069,,1,,,,,,,,,,1,,,,JAN,Monnau
104743324,,1,,,,,,,,1,,,,,,JAN,Monnau
104878295,,1,,1,1,1,,,1,,1,1,1,,,WAN,Findau
104888642,,1,,,,,,,,,,1,,,,WAN,Findau
105054132,,1,,,,,,,,1,,,,,,WAN,Findau
105054883,,1,,1,1,1,,,,,,1,1,,,CAN,Dallau
105264005,,1,,1,1,1,,,,,1,1,1,,,WAN,Findau
105374378,,1,,,,,,,,,,1,,,,WAN,Findau
105499010,,1,,,,,,,,1,,,,,,WAN,Findau
105689781,,1,,,,,,,,,1,1,1,,,CAN,Nondau
105702081,,1,,,,,,,,,,1,,,,CAN,Nondau
105957326,,1,,,,,,,,1,,,,,,CAN,Nondau
105991406,,1,,1,1,1,,,,,,1,1,,,PAN,Pindau
106175169,,1,,,,,,,,,,1,,,,PAN,Pindau
106346630,,1,,,,,,,,1,,,,,,PAN,Pindau
106412383,,1,,,,,,,,1,,,1,,,CAN,Dallau
106492861,,1,,1,1,1,,,1,1,,,1,,,CAN,Findau
106612329,,1,,,,,,,,,,1,,,,CAN,Findau
106704130,,1,,,,,,,,1,,,,,,CAN,Findau
106809260,,1,,1,1,1,,,,,1,1,1,,,WAN,Pindau
106821533,,1,,,,,,,,,,1,,,,WAN,Pindau
107118131,,1,,,,,,,,1,,,,,,WAN,Pindau
107186680,,1,,,,,,,,,1,,1,,,WAN,Findau
107238650,,1,,,,,,,,,,1,,,,WAN,Findau
107261731,,1,,,,,,,,,,,,,,WAN,Findau
107399715,,1,,1,,1,1,,,,,1,1,,,JAN,Findau
107450828,,1,,,,,,,,,,1,,,,JAN,Findau
107558874,,1,,,,,,,,1,,,,,,JAN,Findau
107867487,,1,,1,1,1,,,1,1,,,1,,,PAN,Dallau
107888208,,1,,,,,,,,,,1,,,,PAN,Dallau
108289249,,1,,,,,,,,1,,,,,,PAN,Dallau
108357494,,1,,1,1,1,,,1,,1,1,1,,,CAN,Monnau
108395385,,1,,,,,,,,,,1,,,,CAN,Monnau
108403695,,1,,,,,,,,1,,,,,,CAN,Monnau
108567004,,1,,,,,,,,1,,,1,,,WAN,Balau
108755730,,1,,,,,,,,,,1,,,,WAN,Balau
108801580,,1,,,,,,,,1,,,,,,WAN,Balau
109061068,,1,,1,1,1,,,,,,1,1,,,PAN,Findau
109127180,,1,,,,,,,,,,1,,,,PAN,Findau
109229003,,1,,,,,,,,1,,,,,,PAN,Findau
109234710,,1,,1,1,1,,,,1,1,,1,,,PAN,Findau
109235874,,1,,,,,,,,,,1,,,,PAN,Findau
109321285,,1,,,,,,,,1,,,,,,PAN,Findau
109356603,,1,,1,1,1,,,,,,1,1,,,JAN,Balau
109623314,,1,,,,,,,,,,1,,,,JAN,Balau
109680125,,1,,,,,,,,1,,,,,,JAN,Balau
109703947,,1,,,,,,,,,1,1,1,,,PAN,Dallau
109750529,,1,,,,,,,,1,,,1,,,CAN,Dallau
110001953,,1,,,,,,,,1,1,,1,,,CAN,Balau
110049857,,1,,1,,1,1,,,1,,,1,,,WAN,Balau
110311955,,1,,,,,,,,,,1,,,,WAN,Balau
110354094,,1,,,,,,,,1,,,,,,WAN,Balau
110475780,,1,,,,,,,,1,1,,1,,,PAN,Findau
110545542,,1,,,,,,,,,,1,,,,PAN,Findau
110709684,,1,,,,,,,,1,,,,,,PAN,Findau
110897132,,1,,1,1,1,,,1,1,1,,1,,,JAN,Balau
111057081,,1,,,,,,,,,,1,,,,JAN,Balau
111169111,,1,,,,,,,,1,,,,,,JAN,Balau
111221247,,1,,1,1,1,,,,1,,,1,,,CAN,Dallau
111433154,,1,,,,,,,,,,1,,,,CAN,Dallau
111638783,,1,,,,,,,,1,,,,,,CAN,Dallau
111791056,,1,,,,,,,,,,1,1,,,CAN,Findau
111896200,,1,,,,,,,,,,1,,,,CAN,Findau
111904165,,1,,,,,,,,1,,,,,,CAN,Findau
112137116,,1,,,,,,,,,1,1,1,,,CAN,Pindau
112195877,,1,,,,,,,,,,1,,,,CAN,Pindau
112242032,,1,,,,,,,,1,,,,,,CAN,Pindau
112336184,,1,,1,1,1,,,,1,1,,1,,,FAN,Monnau
112406141,,1,,,,,,,,,,1,,,,FAN,Monnau
112502877,,1,,,,,,,,1,,,,,,FAN,Monnau
112529548,,1,,1,1,1,,,,1,1,,1,,,FAN,Balau
112689042,,1,1,,,,,,,,,1,1,1,,WAN,Dallau
112922146,,1,,,,,,,,,,1,,,,WAN,Dallau
112970355,,1,,,,,,,,1,,,,,,WAN,Dallau
113342540,,1,,,,,,,,1,,,1,,,JAN,Balau
113678114,,1,,,,,,,,,,1,,,,JAN,Balau
113841421,,1,,,,,,,,1,,,,,,JAN,Balau
113895537,,1,,1,1,1,,,,1,,,1,,,JAN,Pindau
114099776,,1,,,,,,,,,,1,,,,JAN,Pindau
114137929,,1,,,,,,,,1,,,,,,JAN,Pindau
114204557,,1,,1,1,1,,,,1,,,1,,,FAN,Findau
114284319,,1,,,,,,,,,,1,,,,FAN,Findau
114371795,,1,,,,,,,,1,,,,,,FAN,Findau
114398538,,1,,,,,,,,,,1,1,,,FAN,Findau
114447791,,1,,1,1,1,,,,,,1,1,,,FAN,Dallau
114465736,,1,,,,,,,,,,1,,,,FAN,Dallau
114526805,,1,,,,,,,,1,,,,,,FAN,Dallau
114537398,,1,,1,,1,1,,,,1,1,1,,,CAN,Monnau
114682497,,1,,,,,,,,,,1,,,,CAN,Monnau
114693074,,1,,,,,,,,1,,,,,,CAN,Monnau
114739333,,1,,1,1,1,,,,,,1,1,,,JAN,Findau
114785102,,1,,,,,,,,,,1,,,,JAN,Findau
114840514,,1,,,,,,,,1,,,,,,JAN,Findau
114877543,,1,,,,,,,,,,1,1,,,CAN,Balau
114926274,,1,,1,1,1,,,1,,,1,1,,,PAN,Findau
114926541,,1,,,,,,,,,,1,,,,PAN,Findau
114979784,,1,,,,,,,,1,,,,,,PAN,Findau
115027694,,1,,1,1,1,,,,1,,,1,,,CAN,Monnau
115078251,,1,,,,,,,,,,1,,,,CAN,Monnau
115110047,,1,,,,,,,,1,,,,,,CAN,Monnau
115292693,,1,,1,1,1,,,1,,1,1,1,,,FAN,Dallau
115300858,,1,,,,,,,,,,1,,,,FAN,Dallau
115385932,,1,,,,,,,,1,,,,,,FAN,Dallau
115458801,,1,,,,,,,1,1,,,1,,,PAN,Pindau
115496404,,1,,,,,,,,,,1,,,,PAN,Pindau
115545321,,1,,,,,,,,1,,,,,,PAN,Pindau
115555825,,1,,,,,,,,,,1,1,,,FAN,Findau
115590481,,1,,1,1,1,,,,1,,,1,,,PAN,Nondau
115716707,,1,,,,,,,,,,1,,,,PAN,Nondau
115717345,,1,,,,,,,,1,,,,,,PAN,Nondau
115830160,1,,,,,,,,,,1,1,1,,,PAN,Findau
115840603,,1,,,,,,,,,,1,,,,PAN,Findau
115875941,,1,,,,,,,,1,,,,,,PAN,Findau
115917411,,1,,1,1,1,,,,1,1,,1,,,CAN,Monnau
115983018,,1,,,,,,,,,,,,,,CAN,Monnau
116134294,,1,,,,,,,,,,,,,,CAN,Monnau
116208114,,1,,1,1,1,,,,1,,,1,,,FAN,Balau
116253696,,1,,,,,,,,,,1,,,,FAN,Balau
116269930,,1,,,,,,,,1,,,,,,FAN,Balau
116274975,,1,,1,1,1,,,,1,1,,1,,,FAN,Balau
116618879,,1,,,,,,,,,,1,,,,FAN,Balau
116827438,,1,,,,,,,,1,,,,,,FAN,Balau
116954552,,1,,,,,,,,,,1,1,,,FAN,Pindau
116990055,,1,,,,,,,,,,1,,,,FAN,Pindau
117067558,,1,,,,,,,,1,,,,,,FAN,Pindau
117133967,,1,,1,1,1,,,,1,,,1,,,FAN,Findau
117203609,,1,,,,,,,,,,1,,,,FAN,Findau
117345990,,1,,,,,,,,1,,,,,,FAN,Findau
117414195,,1,,1,1,1,,,,,,1,1,,,WAN,Dallau
117701259,,1,,1,1,1,,,,,1,1,1,,,PAN,Findau
117714179,,1,,,,,,,,,,1,,,,PAN,Findau
117749882,,1,,,,,,,,1,,,,,,PAN,Findau
118200287,,1,,,,,,,,1,,,1,,,PAN,Balau
118324223,,1,,,,,,,,,,1,,,,PAN,Balau
118347950,,1,,,,,,,,1,,,,,,PAN,Balau
118493985,,1,,1,1,1,,,,,1,1,1,,,CAN,Balau
118516187,,1,,,,,,,,,,1,1,,,PAN,Balau
118576048,,1,,1,1,1,,,,1,1,,1,,,CAN,Pindau
119061846,,1,,,,,,,,,,1,,,,CAN,Pindau
119112931,,1,,,,,,,,1,,,,,,CAN,Pindau
119173598,,1,,1,1,1,,,,,,1,1,,,PAN,Findau
119214446,,1,,,,,,,,,,1,,,,PAN,Findau
119450415,,1,,,,,,,,1,,,,,,PAN,Findau
119524416,,1,,1,,1,1,,,1,1,,1,,,CAN,Pindau
119562177,,1,,,,,,,,,,1,,,,CAN,Pindau
119566924,,1,,,,,,,,1,,,,,,CAN,Pindau
119620045,,1,,1,1,1,,,1,1,1,,1,,,JAN,Findau
120103823,,1,,1,1,1,,,,,1,1,1,,,JAN,Findau
120280910,,1,,1,1,1,,,,,,1,1,,,CAN,Balau
120376239,,1,,,,,,,,1,1,,1,,,JAN,Balau
120408884,,1,,,,,,,,,,1,,,,JAN,Balau
120616243,,1,,,,,,,,1,,,,,,JAN,Balau
120966205,,1,,1,1,1,,,,,,1,1,,,FAN,Balau
120982993,,1,,,,,,,,1,,,1,,,CAN,Balau
120984958,,1,,,,,,,,1,,,1,,,FAN,Dallau
121145637,,1,,,,,,,,,,1,,,,FAN,Dallau
121172789,,1,,,,,,,,1,,,,,,FAN,Dallau
121238261,,1,,1,1,1,,,,,1,1,1,,,CAN,Balau
121282412,,1,,,,,,,,,,1,,,,CAN,Balau
121285057,,1,,,,,,,,1,,,,,,CAN,Balau
121320224,,1,,,,,,,,,1,1,1,,,PAN,Findau
121367223,,1,,,,,,,,,,1,,,,PAN,Findau
121530292,,1,,,,,,,,1,,,,,,PAN,Findau
121822064,,1,,,,,,,,,,1,1,,,FAN,Findau
121895310,,1,,,,,,,,,,1,,,,FAN,Findau
121932925,,1,,,,,,,,1,,,,,,FAN,Findau
122276766,,1,,1,1,1,,,,,,,1,,,PAN,Balau
122455767,,1,,,,,,,,,,1,,,,PAN,Balau
122471189,,1,,,,,,,,1,,,,,,PAN,Balau
122521232,,1,,1,,1,1,,,,1,1,1,,,CAN,Findau
122659763,,1,,,,,,,,,,1,,,,CAN,Findau
122694042,,1,,,,,,,,1,,,,,,CAN,Findau
122743948,,1,,,,,,,,1,,,1,,,WAN,Dallau
122851386,,1,,,,,,,,,,,,,,WAN,Dallau
122929946,,1,,,,,,,,1,,,,,,WAN,Dallau
122944983,,1,,1,1,1,,,,,1,1,1,,,FAN,Pindau
122995979,,1,,,,,,,,,,1,,,,FAN,Pindau
123107115,,1,,,,,,,,1,,,,,,FAN,Pindau
123121089,,1,,,,,,,,1,,,1,,,CAN,Balau
123180890,,1,,,,,,,,,,1,,,,CAN,Balau
123264279,,1,,,,,,,,1,,,,,,CAN,Balau
123407899,,1,,1,,1,1,,,,,1,1,,,FAN,Findau
123544018,,1,,,,,,,,,,1,,,,FAN,Findau
123596611,,1,,,,,,,,1,,,,,,FAN,Findau
123613257,,1,,,,,,,,,,1,1,,,PAN,Dallau
123902433,,1,,,,,,,,,,1,,,,PAN,Dallau
124157729,,1,,,,,,,,1,,,,,,PAN,Dallau
124407298,,1,,1,1,1,,,1,1,1,,1,,,FAN,Balau
124439256,,1,,,,,,,,1,1,,1,,,JAN,Balau
124660592,,1,,,,,,,,,,1,,,,JAN,Balau
124721288,,1,,,,,,,,1,,,,,,JAN,Balau
124987174,,1,,1,1,1,,,,,1,1,1,,,CAN,Balau
124987228,,1,,,,,,,,,,1,,,,CAN,Balau
124997176,,1,,,,,,,,1,,,,,,CAN,Balau
125002676,,1,,1,1,1,,,,,,,1,,,PAN,Balau
125015674,,1,,1,,1,1,,1,,1,,1,,,FAN,Pindau
125086611,,1,,,,,,,,,,1,,,,FAN,Pindau
125194715,,1,,,,,,,,1,,,,,,FAN,Pindau
125237413,,1,,,,,,,,1,1,,1,,,CAN,Findau
125240753,,1,,,,,,,,,,1,,,,CAN,Findau
125543462,,1,,,,,,,,1,,,,,,CAN,Findau
125606912,,1,,,,,,,,1,,,1,,,WAN,Dallau
125777117,,1,,,,,,,,,,1,,,,WAN,Dallau
125923895,,1,,,,,,,,1,,,,,,WAN,Dallau
125976278,,1,,1,1,1,,,,1,,,1,,,CAN,Balau
126315566,,1,,,,,,,,1,,,1,,,FAN,Findau
126711817,,1,,,,,,,,,,1,,,,FAN,Findau
127146000,,1,,,,,,,,1,,,,,,FAN,Findau
127152584,,1,,1,1,1,,,,,,1,1,,,CAN,Findau
127246489,,1,,,,,,,,,,1,,,,CAN,Findau
127395803,,1,,,,,,,,1,,,,,,CAN,Findau
127401497,,1,,1,1,1,,,,,,1,1,,,CAN,Dallau
127567211,,1,,1,,1,1,,,1,1,,1,,,JAN,Findau
127585448,,1,,,,,,,,,,1,,,,JAN,Findau
127843228,,1,,,,,,,,1,,,,,,JAN,Findau
127984113,,1,,1,1,1,,,,,,1,1,,,FAN,Dallau
128105268,,1,,,,,,,,,,1,,,,FAN,Dallau
128214485,,1,,,,,,,,1,,,,,,FAN,Dallau
128348120,,1,,1,,1,1,,,,1,1,1,,,CAN,Dallau
128801904,,1,,,,,,,,,,1,,,,CAN,Dallau
128804077,,1,,,,,,,,1,,,,,,CAN,Dallau
128826504,,1,,,,,,,,,1,1,1,,,FAN,Nondau
128829277,,1,,,,,,,,,,1,,,,FAN,Nondau
129142086,,1,,,,,,,,1,,,,,,FAN,Nondau
129154602,1,,,1,1,1,,,,,,1,1,,,WAN,Dallau
129347930,,1,,,,,,,,,,1,,,,WAN,Dallau
129529376,,1,,,,,,,,1,,,,,,WAN,Dallau
129583477,,1,,,,,,,,,1,1,1,,,PAN,Pindau
129625772,,1,,,,,,,,,,1,,,,PAN,Pindau
129660802,,1,,,,,,,,1,,,,,,PAN,Pindau
129768216,,1,,,,,,,1,,1,1,1,,,JAN,Findau
129779233,,1,,,,,,,,,,1,,,,JAN,Findau
129868777,,1,,,,,,,,1,,,,,,JAN,Findau
129911912,,1,,1,1,1,,,,,1,1,1,,,FAN,Findau
130092304,,1,,,,,,,,,,1,,,,FAN,Findau
130149880,,1,,,,,,,,1,,,,,,FAN,Findau
130394298,,1,,1,1,1,,,,1,,,1,,,JAN,Findau
130467337,,1,,,,,,,,,,1,,,,JAN,Findau
130499195,,1,,,,,,,,1,,,,,,JAN,Findau
130617570,,1,,1,1,1,,,,1,1,,1,,,CAN,Monnau
131026971,,1,,,,,,,,,,1,,,,CAN,Monnau
131031466,,1,,,,,,,,1,,,,,,CAN,Monnau
131050761,,1,1,,,,,,,1,,,1,,1,PAN,Findau
131056115,,1,,,,,,,,,,1,,,,PAN,Findau
131145177,,1,,,,,,,,1,,,,,,PAN,Findau
131183272,,1,,,,,,,,1,1,,1,,,PAN,Findau
131214011,,1,,,,,,,,,,1,,,,PAN,Findau
131351298,,1,,,,,,,,1,,,,,,PAN,Findau
131586233,,1,,1,1,1,,,,1,,,1,,,FAN,Balau
131807861,,1,,1,1,1,,,1,1,1,,1,,,PAN,Balau
131854622,,1,,,,,,,,,,1,,,,PAN,Balau
131888204,,1,,,,,,,,,,,,,,PAN,Balau
131959202,,1,,,,,,,,1,,,1,,,CAN,Pindau
132348242,,1,,,,,,,,,,1,,,,CAN,Pindau
132355431,,1,,,,,,,,1,,,,,,CAN,Pindau
132378592,,1,,1,1,1,,,,1,1,,1,,,JAN,Findau
132441719,,1,,,,,,,,,,1,,,,JAN,Findau
132488731,,1,,,,,,,,1,,,,,,JAN,Findau
132500561,,1,,,,,,,,,1,1,1,,,CAN,Pindau
132595755,,1,,,,,,,,,,1,,,,CAN,Pindau
132665096,,1,,,,,,,,1,,,,,,CAN,Pindau
132762415,,1,,1,1,1,,,,1,,,1,,,CAN,Pindau
132982071,,1,,,,,,,,,,1,,,,CAN,Pindau
133321848,,1,,,,,,,,1,,,,,,CAN,Pindau
133388277,,1,,1,,1,1,,,,1,1,1,,,FAN,Balau
133451947,,1,,,,,,,,,,1,,,,FAN,Balau
133510695,,1,,,,,,,,1,,,,,,FAN,Balau
133513774,,1,,1,,1,1,,,,,1,1,,,WAN,Findau
133567079,,1,,,,,,,,,,1,,,,WAN,Findau
134054025,,1,,,,,,,,1,,,,,,WAN,Findau
134167999,,1,,,,,,,,,1,1,1,,,PAN,Balau
134281518,,1,,,,,,,,,,1,,,,PAN,Balau
134359336,,1,,,,,,,,1,,,,,,PAN,Balau
134423819,,1,,,,,,,,,,1,1,,,FAN,Findau
134540445,,1,,1,,1,1,,,,,,1,,,JAN,Findau
134550263,,1,,,,,,,,,,1,,,,JAN,Findau
134704683,,1,,,,,,,,1,,,,,,JAN,Findau
134748002,,1,,1,1,1,,,1,,1,1,1,,,JAN,Findau
135255838,,1,,,,,,,,,,1,,,,JAN,Findau
135371791,,1,,,,,,,,1,,,,,,JAN,Findau
135433190,,1,,1,,1,1,,,,,1,1,,,JAN,Findau
135532634,,1,,,,,,,,,,1,,,,JAN,Findau
135638275,,1,,,,,,,,1,,,,,,JAN,Findau
135760763,,1,,1,1,1,,,,1,,,1,,,JAN,Findau
136100809,,1,,,,,,,,,,1,,,,JAN,Findau
136110596,,1,,,,,,,,1,,,,,,JAN,Findau
136187049,,1,,,,,,,,1,,,1,,,JAN,Pindau
136357596,,1,,,,,,,,,,1,,,,JAN,Pindau
136482561,,1,,,,,,,,1,,,,,,JAN,Pindau
136520974,,1,,1,,1,1,,1,1,,,1,,,FAN,Monnau
136544058,,1,,,,,,,,,,1,,,,FAN,Monnau
136569975,,1,,,,,,,,1,,,,,,FAN,Monnau
136659289,,1,,1,1,1,,,,1,1,,1,,,CAN,Balau
136802339,,1,,1,1,1,,,,1,1,,1,,,FAN,Dallau
136887728,,1,,,,,,,,,,1,,,,FAN,Dallau
137001812,,1,,,,,,,,1,,,,,,FAN,Dallau
137242140,,1,,,,,,,,,,1,1,,,PAN,Findau
137244410,,1,,,,,,,,,,1,,,,PAN,Findau
137294496,,1,,,,,,,,1,,,,,,PAN,Findau
137557295,,1,,,,,,,,1,,,1,,,CAN,Findau
137795768,,1,,,,,,,,,,1,,,,CAN,Findau
138145793,,1,,,,,,,,1,,,,,,CAN,Findau
138185866,,1,,,,,,,,,,1,1,,,CAN,Findau
138265875,,1,,,,,,,,,,1,,,,CAN,Findau
138334896,,1,,,,,,,,1,,,,,,CAN,Findau
138368169,,1,,1,1,1,,,,,,,1,,,JAN,Findau
138741060,,1,,,,,,,,,1,1,1,,,JAN,Pindau
138755897,,1,,,,,,,,,,1,,,,JAN,Pindau
138775004,,1,,,,,,,,1,,,,,,JAN,Pindau
138836309,,1,,,,,,,,,,1,1,,,CAN,Monnau
138853507,,1,,,,,,,,,,1,,,,CAN,Monnau
138865063,,1,,,,,,,,1,,,,,,CAN,Monnau
139035340,,1,,1,1,1,,,,1,,,1,,,WAN,Dallau
139079549,,1,,,,,,,,,,1,,,,WAN,Dallau
139098569,,1,,,,,,,,1,,,,,,WAN,Dallau
139169975,,1,,1,,1,1,,,,1,1,1,,,PAN,Findau
139183733,,1,,,,,,,,,,1,,,,PAN,Findau
139240516,,1,,,,,,,,1,,,,,,PAN,Findau
139347913,,1,,,,,,,,1,1,,1,,,CAN,Monnau
139360799,,1,,,,,,,,,,1,,,,CAN,Monnau
139807675,,1,,,,,,,,1,,,,,,CAN,Monnau
139853055,,1,,,,,,,,1,,,1,,,FAN,Dallau
139874564,,1,,,,,,,,,,1,,,,FAN,Dallau
139992733,,1,,,,,,,,1,,,,,,FAN,Dallau
140098195,,1,,1,,1,1,,1,1,,,1,,,FAN,Pindau
140237842,,1,,,,,,,,,,1,,,,FAN,Pindau
140466553,,1,,,,,,,,1,,,,,,FAN,Pindau
140489230,,1,,,,,,,,1,,,1,,,PAN,Dallau
140537430,,1,,1,1,1,,,,,,1,1,,,FAN,Findau
140570418,,1,,,,,,,,,,1,,,,FAN,Findau
140747454,,1,,,,,,,,1,,,,,,FAN,Findau
141288152,,1,,,,,,,,,1,1,1,,,PAN,Dallau
141319575,,1,,,,,,,,1,1,,1,,,FAN,Findau
141441668,,1,,1,,1,1,,,1,1,,1,,,CAN,Monnau
141832936,,1,,,,,,,,,,1,,,,CAN,Monnau
141960608,,1,,,,,,,,1,,,,,,CAN,Monnau
142013936,,1,,,,,,,,,,,1,,,PAN,Findau
142215615,,1,,,,,,,,,,1,,,,PAN,Findau
142512240,,1,,,,,,,,1,,,,,,PAN,Findau
142801201,,1,,,,,,,,,,1,1,,,JAN,Findau
142965805,,1,,1,1,1,,,,,,1,1,,,WAN,Findau
142973252,,1,,,,,,,,,,1,,,,WAN,Findau
143067648,,1,,,,,,,,1,,,,,,WAN,Findau
143144605,,1,,1,1,1,,,,1,1,,1,,,CAN,Findau
143192800,,1,,,,,,,,,,1,,,,CAN,Findau
143232219,,1,,,,,,,,1,,,,,,CAN,Findau
143240757,,1,,1,1,1,,,,,1,1,1,,,PAN,Findau
143385617,,1,,1,,1,1,,,1,,,1,,,FAN,Findau
143389122,,1,,,,,,,,,,1,,,,FAN,Findau
143536907,,1,,,,,,,,1,,,,,,FAN,Findau
143688426,,1,,1,,1,1,,,,1,1,1,,,PAN,Findau
143779233,,1,,,,,,,,,,1,,,,PAN,Findau
143896980,,1,,,,,,,,1,,,,,,PAN,Findau
144006737,,1,,1,1,1,,,,1,,,1,,,FAN,Findau
144083888,,1,,,,,,,,,,1,,,,FAN,Findau
144166629,,1,,,,,,,,1,,,,,,FAN,Findau
144194691,,1,,,,,,,,,,1,1,,,CAN,Findau
144398946,,1,,,,,,,,,,1,,,,CAN,Findau
144503027,,1,,,,,,,,1,,,,,,CAN,Findau
144528506,,1,,1,1,1,,,1,,,1,1,,,WAN,Findau
144736733,,1,,,,,,,,,,1,,,,WAN,Findau
144737561,,1,,,,,,,,1,,,,,,WAN,Findau
144761885,,1,,1,1,1,,,1,1,1,,1,,,PAN,Balau
144964490,,1,,,,,,,,,,1,,,,PAN,Balau
145187335,,1,,,,,,,,1,,,,,,PAN,Balau
145241682,,1,,1,1,1,,,1,1,1,,1,,,CAN,Pindau
145246281,,1,,,,,,,,,,1,,,,CAN,Pindau
145377805,,1,,,,,,,,1,,,,,,CAN,Pindau
145570538,,1,,1,1,1,,,,1,,,1,,,WAN,Dallau
145841364,,1,,,,,,,,,,1,,,,WAN,Dallau
145852159,,1,,,,,,,,1,,,,,,WAN,Dallau
145858283,,1,,1,1,1,,,,1,,,1,,,JAN,Dallau
145922865,,1,,,,,,,,,,1,,,,JAN,Dallau
145951055,,1,,,,,,,,1,,,,,,JAN,Dallau
146007559,,1,,1,1,1,,,,,,1,1,,,CAN,Pindau
146122452,,1,,,,,,,,,,1,,,,CAN,Pindau
146307524,,1,,,,,,,,1,,,,,,CAN,Pindau
146498096,,1,,1,1,1,,,,,,1,1,,,CAN,Findau
146589189,,1,,,,,,,,,,1,,,,CAN,Findau
146740276,,1,,,,,,,,1,,,,,,CAN,Findau
147257453,,1,,1,1,1,,,,1,1,,1,,,PAN,Findau
147449720,,1,,,,,,,,,,1,,,,PAN,Findau
147522950,,1,,,,,,,,1,,,,,,PAN,Findau
147611257,,1,,1,1,1,,,1,1,,,1,,,PAN,Dallau
147749316,,1,,,,,,,,,,1,,,,PAN,Dallau
147811456,,1,,,,,,,,1,,,,,,PAN,Dallau
147815422,,1,,1,1,1,,,,,,1,1,,,FAN,Pindau
147906765,,1,,,,,,,,,,1,,,,FAN,Pindau
147954101,,1,,,,,,,,1,,,,,,FAN,Pindau
148020710,,1,,,,,,,,,,1,1,,,WAN,Dallau
148080741,,1,,,,,,,,,,1,,,,WAN,Dallau
148262462,,1,,,,,,,,1,,,,,,WAN,Dallau
148385735,,1,,,,,,,,,,1,1,,,FAN,Pindau
148386380,,1,,,,,,,,,,1,,,,FAN,Pindau
148450097,,1,,,,,,,,1,,,,,,FAN,Pindau
148464416,,1,,,,,,,,,,1,1,,,FAN,Findau
148890545,,1,,,,,,,,,,1,,,,FAN,Findau
148934746,,1,,,,,,,,1,,,,,,FAN,Findau
149034199,,1,,,,,,,,,,1,1,,,PAN,Dallau
149098004,,1,,,,,,,,,,1,,,,PAN,Dallau
149185007,,1,,,,,,,,1,,,,,,PAN,Dallau
149443834,,1,,,,,,,,,,1,1,,,CAN,Findau
149580058,,1,,,,,,,,,,1,,,,CAN,Findau
149963068,,1,,,,,,,,1,,,,,,CAN,Findau
149999473,,1,,1,1,1,,,1,,1,1,1,,,JAN,Findau
150332161,,1,,,,,,,,1,,,1,,,FAN,Findau
150490825,,1,,,,,,,,,,1,,,,FAN,Findau
150528639,,1,,,,,,,,1,,,,,,FAN,Findau
150895857,,1,,,,,,,,1,,,1,,,JAN,Findau
151183473,,1,,,,,,,,,,1,,,,JAN,Findau
151293589,,1,,,,,,,,1,,,,,,JAN,Findau
151338781,,1,,,,,,,,1,,,1,,,FAN,Dallau
151411531,,1,,,,,,,,,,1,1,,,JAN,Findau
151657603,,1,,,,,,,,,,1,,,,JAN,Findau
151697417,,1,,,,,,,,1,,,,,,JAN,Findau
151778507,,1,,,,,,,,,,1,1,,,FAN,Clindau
151951271,,1,,,,,,,,,,1,,,,FAN,Clindau
151973040,,1,,,,,,,,1,,,,,,FAN,Clindau
152188388,,1,,1,1,1,,,,1,1,,1,,,PAN,Findau
152314259,,1,,,,,,,,,,1,,,,PAN,Findau
152337689,,1,,,,,,,,1,,,,,,PAN,Findau
152370411,,1,,1,1,1,,,,1,,,1,,,FAN,Pindau
152479685,,1,,,,,,,,,,1,,,,FAN,Pindau
152511567,,1,,,,,,,,1,,,,,,FAN,Pindau
152617790,,1,,,,,,,,1,,,1,,,FAN,Pindau
152786858,,1,,,,,,,,,,1,,,,FAN,Pindau
152882833,,1,,,,,,,,1,,,,,,FAN,Pindau
153008721,,1,,1,1,1,,,1,1,,,1,,,JAN,Findau
153031636,,1,,,,,,,,,,1,,,,JAN,Findau
153047225,,1,,,,,,,,1,,,,,,JAN,Findau
153368111,,1,,1,1,1,,,,1,1,,1,,,CAN,Findau
153490769,,1,,,,,,,,,,1,,,,CAN,Findau
153790208,,1,,,,,,,,1,,,,,,CAN,Findau
153862678,,1,,1,1,1,,,,,,1,1,,,FAN,Findau
154090018,,1,,,,,,,,,,1,,,,FAN,Findau
154255484,,1,,,,,,,,1,,,,,,FAN,Findau
154535789,,1,,1,1,1,,,,,,1,1,,,FAN,Balau
154555546,,1,,,,,,,,,,1,,,,FAN,Balau
154558803,,1,,,,,,,,1,,,,,,FAN,Balau
154689100,,1,,1,1,1,,,,,,1,1,,,WAN,Findau
154759041,,1,,,,,,,,,,1,,,,WAN,Findau
154789599,,1,,,,,,,,1,,,,,,WAN,Findau
154799334,,1,,,,,,,,,,1,,,,CAN,Findau
154844518,,1,,,,,,,,,,1,,,,CAN,Findau
154854753,,1,,,,,,,,1,,,,,,CAN,Findau
154890613,,1,,1,1,1,,,1,,1,1,1,,,WAN,Clindau
154952492,,1,,,,,,,,,,1,,,,WAN,Clindau
154969789,,1,,,,,,,,1,,,,,,WAN,Clindau
155015746,,1,,,,,,,1,,,1,1,,,JAN,Monnau
155021234,,1,,,,,,,,,,1,,,,JAN,Monnau
155177441,,1,,,,,,,,1,,,,,,JAN,Monnau
155475974,,1,,,,,,,,,,1,1,,,FAN,Findau
155679715,,1,,,,,,,,,,1,,,,FAN,Findau
155709352,,1,,,,,,,,1,,,,,,FAN,Findau
155958568,1,,,1,1,1,,,,,1,1,1,,,WAN,Dallau
156085506,,1,,,,,,,,,,1,,,,WAN,Dallau
156103073,,1,,,,,,,,1,,,,,,WAN,Dallau
156575104,,1,,,,,,,,,1,1,1,,,WAN,Dallau
156577705,,1,,,,,,,,,,1,,,,WAN,Dallau
156599500,,1,,,,,,,,1,,,,,,WAN,Dallau
156683203,,1,,1,1,1,,,1,1,,,1,,,CAN,Findau
156690185,,1,,,,,,,,,,1,,,,CAN,Findau
156841436,,1,,,,,,,,1,,,,,,CAN,Findau
156863856,,1,,1,1,1,,,1,1,,,1,,,PAN,Dallau
157058753,,1,,,,,,,,,,1,,,,PAN,Dallau
157099006,,1,,,,,,,,1,,,,,,PAN,Dallau
157188008,,1,,1,,1,1,,,1,,,1,,,FAN,Findau
157230382,,1,,,,,,,,,,1,,,,FAN,Findau
157352705,,1,,,,,,,,1,,,,,,FAN,Findau
157401213,,1,,,,,,,,1,,,1,,,CAN,Monnau
157425949,,1,,,,,,,,,,1,,,,CAN,Monnau
157597095,,1,,,,,,,,1,,,,,,CAN,Monnau
157985933,,1,,1,1,1,,,,,,1,,,,FAN,Balau
158057921,,1,,,,,,,,,,1,,,,FAN,Balau
158073550,,1,,,,,,,,1,,,,,,FAN,Balau
158561141,,1,,1,,1,1,,,1,,,1,,,FAN,Findau
158899765,,1,,,,,,,,,,1,,,,FAN,Findau
158955338,,1,,,,,,,,1,,,,,,FAN,Findau
159325391,,1,,1,1,1,,,,,,,1,,,CAN,Findau
159423108,,1,,,,,,,,,,1,,,,CAN,Findau
159746160,,1,,,,,,,,1,,,,,,CAN,Findau
159759538,,1,,1,1,1,,,1,,,1,1,,,JAN,Monnau
159762539,,1,,,,,,,,,,1,,,,JAN,Monnau
159929545,,1,,,,,,,,1,,,,,,JAN,Monnau
160083361,1,,,1,1,1,,,1,1,,,1,,,PAN,Findau
160224260,,1,,,,,,,,,,1,,,,PAN,Findau
160451690,,1,,,,,,,,1,,,,,,PAN,Findau
160475026,,1,,1,,1,1,,,,1,1,1,,,JAN,Monnau
160609416,,1,,,,,,,,,,1,,,,JAN,Monnau
160706878,,1,,,,,,,,1,,,,,,JAN,Monnau
160799103,,1,,1,,1,1,,,,,1,1,,,CAN,Monnau
160938138,,1,,,,,,,,,,1,,,,CAN,Monnau
161441581,,1,,,,,,,,1,,,,,,CAN,Monnau
161566413,,1,,,,,,,,,,1,1,,,PAN,Dallau
161708724,,1,,,,,,,,,,1,,,,PAN,Dallau
161791176,,1,,,,,,,,1,,,,,,PAN,Dallau
162339022,,1,,,,,,,,1,,,,,,FAN,Balau
162409156,1,,,1,,1,1,,,1,,,1,,,FAN,Monnau
162578676,,1,,,,,,,,,,1,,,,FAN,Monnau
162637644,,1,,,,,,,,1,,,,,,FAN,Monnau
162665534,,1,,1,1,1,,,,1,,,1,,,FAN,Monnau
162720214,,1,,,,,,,,,,1,,,,FAN,Monnau
162735478,,1,,,,,,,,1,,,,,,FAN,Monnau
162814464,,1,,1,1,1,,,,1,,,1,,,CAN,Balau
162958402,,1,,,,,,,,,,1,,,,CAN,Balau
162986288,,1,,,,,,,,1,,,,,,CAN,Balau
163058741,,1,,,,,,,,,,1,1,,,CAN,Balau
163385159,,1,,,,,,,,,,1,,,,CAN,Balau
163397211,,1,,,,,,,,1,,,,,,CAN,Balau
163539337,,1,,1,,1,1,,,1,,,,,,CAN,Monnau
163779224,,1,,,,,,,,,,1,,,,CAN,Monnau
163804497,,1,,,,,,,,1,,,,,,CAN,Monnau
163949581,,1,,1,1,1,,,,,,1,1,,,CAN,Balau
164021359,,1,,1,,1,1,,1,,1,1,1,,,FAN,Findau
164137937,,1,,,,,,,,,,,,,,FAN,Findau
164165722,,1,,,,,,,,,,,,,,FAN,Findau
164274644,1,,,1,,1,1,,,,,,1,,,CAN,Dallau
164345911,,1,,,,,,,,,,1,,,,CAN,Dallau
164430437,,1,,,,,,,,1,,,,,,CAN,Dallau
164513410,,1,,,,,,,,1,,,1,,,CAN,Findau
164679608,,1,,,,,,,,,,,,,,CAN,Findau
164942847,,1,,,,,,,,,,,,,,CAN,Findau
165010947,,1,,1,1,1,,,,,,1,1,,,FAN,Findau
165073407,,1,,,,,,,,,,1,,,,FAN,Findau
165126699,,1,,,,,,,,1,,,,,,FAN,Findau
165163594,,1,,1,1,1,,,,1,1,,1,,,JAN,Findau
165272210,,1,,,,,,,,,,1,,,,JAN,Findau
165456068,,1,,,,,,,,1,,,,,,JAN,Findau
165622537,,1,,1,1,1,,,,1,1,,,,,CAN,Pindau
165652192,,1,,,,,,,,,,1,,,,CAN,Pindau
165762013,,1,,,,,,,,1,,,,,,CAN,Pindau
165803587,,1,,1,,1,1,,,,,1,1,,,CAN,Pindau
166072412,,1,,,,,,,,,,1,,,,CAN,Pindau
166171598,,1,,,,,,,,1,,,,,,CAN,Pindau
166233181,,1,,,,,,,,,,1,1,,,JAN,Findau
166289108,,1,,,,,,,,,,,,,,JAN,Findau
166343459,,1,,,,,,,,1,,,,,,JAN,Findau
166550536,,1,,,,,,,,1,,,1,,,CAN,Monnau
166558108,,1,,,,,,,,,,1,,,,CAN,Monnau
166714776,,1,,,,,,,,1,,,,,,CAN,Monnau
166866157,,1,,,,,,,,,,1,1,,,CAN,Pindau
166971291,,1,,,,,,,,,,1,,,,CAN,Pindau
167223059,,1,,,,,,,,1,,,,,,CAN,Pindau
167417058,,1,,1,1,1,,,,,,1,,,,PAN,Dallau