released_key,family,,,curated_sex,1|89355278|rs7537937|GBP7|rs7537937,1|157441307|rs2814778|DARC|rs2814778,1|205007454|rs3024500|IL10|IL10_232424450,1|205013520|rs1800896|IL10|hIL-10-1082,1|205015988|rs1800890|IL10|hIL-10-3533,1|205849479|rs17047660|CR1|rs17047660,1|205849512|rs17047661|CR1|rs17047661,2|113259694|rs17411697|IL1A|rs17411697,2|113306861|rs1143634|IL1B|rs1143634,3|9935070|rs708567|IL17RE|rs708567,3|52236071|rs187084|TLR9|TLR9_rs187084,3|57113459|rs6780995|IL17RD|rs6780995,4|38476105|rs4833095|TLR1|tlr1_rs4833095,4|38476609|rs5743611|TLR1|tlr1_rs5743611,4|38506745|rs5743810|TLR6|tlr6_rs5743810,4|38506909|rs5743809|TLR6|TLR6_rs5743809,5|41235716|rs1801033|C6|rs1801033,5|131854779|rs2706384|IRF1|5-131349023,5|132023863|rs20541|IL13|hIL-13_46457,5|132037053|rs2243250|IL4|hIL-4-589,6|31648120|rs2239704|LTA|LTA_plus77,6|31648292|rs909253|LTA|hLT-alpha_NcoI,6|31650287|rs1799964|TNF|hTNFa-1031,6|31650943|rs1800750|TNF|hTNF-376,6|31651010|rs1800629|TNF|hTNF-308,6|31651080|rs361525|TNF|hTNF-238,6|31652168|rs3093662|TNF|hTNF_plus851,6|31947288|rs2242665|CTL4|rs2242665,6|137367540|rs1555498|IL20RA|rs1555498,7|30458762|rs2075820|NOD1|rs2075820,7|80138385|rs3211938|CD36|hCD36_T1264G,7|80140046||CD36|hCD36_G1439C,7|80140051||CD36|hCD36_I1444D,7|117017519|rs17140229|CFTR|rs17140229,9|119515123|rs4986790|TLR4|rs4986790,9|119515423|rs4986791|TLR4|rs4986791,9|135121143|rs8176746|ABO|rs8176746,11|5204749|rs33950507|KRT121P|rs33950507,11|5204808|rs334|HBD|hHbS,11|5675093|rs7935564|TRIM5|rs7935564,11|63243962|rs542998|RTN3|rs542998,12|66928914|rs2227507|IL22|12-72245636,12|66930885|rs1012356|IL22|12-72247607,12|66932788|rs2227491|IL22|12-72249510,12|66933980|rs2227485|IL22|12-72250702,12|66934889|rs2227478|IL22|12-72251611,14|64333053|rs229587|SPTB|rs229587,16|3973437|rs2230739|ADCY9|rs2230739,16|4019824|rs10775349|ADCY9|rs10775349,16|27281681|rs1805015|IL4R|IL4R-63011,17|15802057|rs2535611|ADORA2B|rs2535611,17|23120724|rs2297518|NOS2A|rs2297518,17|23152636|rs12720463|NOS2A|hNOS2-954,17|23152855|rs9282799|NOS2A|rs9282799,17|23153339|rs8078340|NOS2A|hNOS2-1659,19|6870624|rs373533|EMR1|rs373533,19|6870753|rs461645|EMR1|rs461645,19|10255792|rs1799969|ICAM1|hICAM-1codon241,19|10256683|rs5498|ICAM1|hICAM-1codon469,20|56919207|rs8386|GNAS|GNAS_8386,22|22509132|rs3177244|DERL3|rs3177244,X|135557275|rs3092945|CD40LG|rs3092945,X|135558221|rs1126535|CD40LG|rs17424229,X|153416686|rs1050829|G6PD|hG6PD_plus376,X|153417411|rs1050828|G6PD|hG6PD_plus202,XY|11223656||AMELX|amelogenin_XY_SNP1,XY|11226027||AMELX|amelogenin_XY_SNP2,XY|11226571||AMELX|amelogenin_XY_SNP6
100051977,6,100227748,100164256,F,CC,XX,AG,CT,AA,XX,GG,GG,CC,AG,CT,GG,CC,GG,XX,TT,XX,CC,CT,TT,GG,TT,TT,XX,GG,GG,GG,XX,CT,XX,TT,GG,II,XX,AA,XX,CC,XX,AA,XX,XX,TT,AA,CT,AG,AG,TT,XX,XX,TT,XX,XX,CG,CC,CC,XX,XX,AG,AG,CC,AA,CT,TT,TT,CC,GG,TT,CC
100164256,6,,,M,CC,XX,AA,CT,AA,XX,GG,GG,CC,GG,TT,AG,CT,XX,XX,XX,XX,XX,XX,CT,XX,CT,XX,GG,AG,GG,AA,XX,TT,XX,TT,GG,II,XX,XX,XX,CC,XX,AA,XX,XX,TT,AT,CT,GG,AG,TT,XX,XX,TT,XX,XX,GG,CC,CT,XX,XX,GG,AG,XX,AG,TT,TT,TT,CC,AG,CT,AC
100227748,6,,,F,CC,XX,AG,CT,AA,XX,GG,GT,CC,GG,CT,GG,CC,XX,XX,XX,XX,XX,XX,TT,XX,TT,XX,GG,GG,GG,AG,XX,TT,XX,TT,GG,II,XX,XX,XX,CC,XX,AA,XX,XX,TT,AA,XX,AG,AG,TT,XX,XX,TT,XX,XX,GG,CC,CC,XX,XX,AG,AG,XX,XX,CT,TT,TT,CC,GG,TT,CC
100249164,8,,,M,CG,XX,AA,TT,AA,XX,GG,GT,CC,AG,CT,AG,CC,GG,XX,TT,XX,AC,CC,TT,GT,CT,TT,GG,GG,GG,AA,XX,CT,XX,TT,GG,II,XX,AA,XX,CA,XX,AA,XX,XX,CT,AT,CC,AA,AA,CT,XX,XX,TT,XX,XX,GG,CC,CC,XX,XX,GG,AA,CC,AA,TT,TT,TT,CC,AG,CT,AC
100265634,15,,,F,CG,XX,AG,CT,AA,XX,GG,GT,CC,AA,TT,AA,CC,GG,XX,TT,XX,CC,CC,CT,TT,TT,TT,XX,GG,GG,AA,XX,TT,XX,TT,GG,II,XX,GG,XX,CC,XX,AA,XX,XX,TT,TT,CC,AA,AA,TT,XX,XX,CC,XX,XX,CG,CC,CT,XX,XX,GG,AA,XX,GG,CC,TT,CT,CC,GG,TT,CC
100352101,17,,,M,GG,XX,AA,TT,AA,XX,GG,GT,CC,AG,TT,GG,CC,GG,XX,TT,XX,CC,CC,CT,GG,CT,CT,GG,AG,GG,AA,XX,CT,XX,TT,GG,II,XX,AA,XX,CC,XX,AA,XX,XX,TT,TT,CC,AG,AG,TT,XX,XX,CC,XX,XX,GG,CT,CC,XX,XX,GG,AA,CC,GG,CC,TT,TT,CC,AG,CT,AC
100456287,21,,,M,CG,GG,AG,CT,AT,AA,GG,GG,CC,AG,CT,AA,CC,GG,CC,TT,AC,AC,CC,CT,GG,CC,TT,GG,AG,GG,AA,AA,CC,GG,TT,GG,II,TT,AA,CC,CA,GG,AA,AA,TT,TT,AT,CT,GG,AG,CT,AA,CC,TT,TT,GG,GG,CC,CT,GG,CC,GG,AA,CC,GG,CC,TT,TT,CC,AG,CT,AC
100507085,28,,,M,CG,XX,AA,TT,AA,XX,GG,GG,CC,AG,CT,GG,CC,GG,XX,TT,XX,AC,CT,TT,TT,TT,TT,GG,GG,GG,AA,XX,CT,XX,TT,GG,II,XX,AA,XX,CC,XX,AA,XX,XX,TT,AT,CC,AG,AG,TT,XX,XX,CT,XX,XX,CG,CC,CC,XX,XX,GG,AG,CC,AA,CC,TT,CC,CC,AG,CT,AC
100771785,29,100992413,100795524,M,CG,GG,AG,CC,AT,AG,AG,GT,CC,AA,CT,AA,CT,GG,CC,TT,AC,CC,CC,CT,GT,TT,CT,AG,GG,AG,AG,AG,TT,AG,TT,GG,II,CT,AA,CC,CC,GG,AA,AG,TT,TT,AT,CT,AG,AG,CT,AA,CG,CT,TT,GG,GG,CC,CC,TT,CT,GG,AA,CC,AA,TT,TT,TT,CC,AG,CT,AC
100795524,29,,,M,CG,GG,AG,CT,AT,AG,AG,GT,CC,AG,CT,AA,CC,GG,CC,TT,AC,CC,CC,CC,TT,TT,TT,GG,GG,GG,AA,AG,CT,AG,TT,GG,II,TT,AA,CC,CC,GG,AA,AA,TT,TT,AT,CT,AG,AG,TT,AA,CG,CT,TT,GG,GG,CC,CT,GG,CC,GG,AA,CC,AA,TT,CC,CC,CC,AG,CT,AC
100992413,29,,,F,GG,XX,AA,TT,XX,AA,XX,XX,CC,AA,XX,AA,XX,GG,XX,XX,XX,AA,XX,TT,XX,TT,XX,GG,GG,GG,XX,XX,XX,XX,TT,GG,II,XX,XX,XX,CC,AG,AA,XX,TT,TT,XX,XX,XX,XX,XX,XX,CC,XX,XX,XX,GG,TT,CC,XX,TT,XX,XX,CT,AA,XX,TT,XX,CC,GG,XX,CC
101038283,30,101337118,101097322,F,CG,GG,AA,TT,AA,AG,GG,GG,CT,AA,CC,XX,CC,GG,CC,TT,AC,AC,CC,TT,GG,CT,TT,GG,GG,GG,AA,AG,CT,AG,TT,GG,II,TT,AA,CC,CC,GG,AA,GG,TT,TT,AT,CT,AG,AG,CT,AG,GG,CT,TT,GG,GG,CC,CT,GG,CC,GG,AA,CC,XX,TT,CT,CT,CC,GG,TT,CC
101097322,30,,,M,CG,GG,AA,TT,AA,GG,GG,GG,CT,AG,CC,AA,CC,GG,CC,TT,CC,AA,CT,TT,GT,TT,TT,GG,GG,GG,AA,AA,CC,AG,TT,GG,II,TT,AA,CC,CC,GG,AA,AG,CT,TT,AA,TT,GG,AG,TT,AA,CG,TT,TT,GG,GG,CC,CT,GG,CC,GG,AG,CC,GG,TT,CC,TT,CC,AG,CT,AC
101337118,30,,,F,CG,GG,AA,TT,AA,AG,GG,GG,CC,AG,CT,AA,CC,GG,CC,TT,AC,AC,CC,TT,GT,CT,TT,GG,GG,GG,AA,AG,TT,GG,TT,GG,II,CT,AA,CC,CC,GG,AA,GG,CT,TT,TT,CC,AA,AA,CT,GG,CG,CC,TT,GG,GG,CC,TT,TT,CT,GG,AG,CC,AG,TT,TT,CC,CC,GG,TT,CC
101340713,33,101365408,101351573,F,CG,XX,AG,CT,AA,XX,GG,GT,CT,AG,CT,AG,CC,XX,XX,XX,XX,AA,XX,CT,GG,TT,CT,GG,GG,AG,AG,XX,TT,XX,TT,GG,II,CT,XX,XX,CC,XX,AA,XX,XX,TT,AT,CT,AG,AG,TT,AA,CG,TT,TT,XX,GG,CT,CT,XX,XX,GG,AA,CC,AG,CC,TT,CC,CC,GG,TT,CC
101351573,33,,,M,CG,XX,AG,CT,AA,XX,GG,TT,CT,AG,CT,AG,CC,XX,XX,XX,XX,AA,XX,CT,GG,CT,TT,GG,GG,GG,AA,XX,CT,XX,TT,GG,II,CT,XX,XX,CC,XX,AA,XX,XX,TT,AT,CT,AG,AG,CT,AA,CC,TT,TT,XX,GG,CT,CT,XX,XX,GG,AA,CC,AA,CC,TT,CC,CC,AG,CT,AC
101365408,33,,,F,GG,XX,AA,TT,AA,XX,GG,GG,CC,AG,TT,GG,CC,XX,XX,XX,XX,AA,XX,CC,GT,TT,CT,GG,GG,AG,AG,XX,CT,XX,TT,GG,II,CT,XX,XX,CC,XX,AT,XX,XX,TT,AA,TT,GG,GG,TT,AA,CG,TT,TT,XX,GG,CC,CT,XX,XX,GG,AA,CT,AG,CT,TT,CT,CC,GG,TT,CC
101406090,38,101876766,101522069,F,CG,GG,AG,CT,AT,AG,AG,GT,CT,GG,CT,AA,CC,GG,CC,TT,AC,AA,CC,CT,GT,TT,TT,GG,GG,GG,AG,AG,CT,AA,TT,GG,II,TT,AG,CC,CA,GG,AA,AA,CC,CT,AA,CC,AA,AA,CT,AG,CG,CC,TT,GG,GG,CC,CC,GT,CT,GG,AA,CC,AA,TT,TT,CT,CC,GG,TT,CC
101522069,38,,,M,CG,GG,AA,TT,AA,GG,GG,GG,CT,GG,CT,AG,CC,GG,CC,TT,AC,AC,CC,CC,GT,TT,TT,GG,GG,GG,AG,GG,CT,AG,TT,GG,II,TT,AG,CC,CC,GG,AA,AA,CT,TT,AT,CC,AA,AA,TT,AG,CC,CC,TT,GG,GG,CC,CT,GT,CT,GG,AA,CC,XX,TT,TT,CC,CC,AG,CT,AC
101876766,38,,,F,XX,GG,AG,CT,AT,AG,AG,GT,CT,GG,TT,AA,CC,GG,CC,TT,AC,AA,CC,TT,TT,TT,TT,GG,GG,GG,AA,AA,TT,AA,TT,GG,II,CT,AA,CC,CA,GG,AA,XX,CT,CT,AT,CC,AA,AA,CC,AA,CG,CT,TT,AG,GG,CC,CC,TT,TT,GG,AA,CC,AA,CT,TT,CT,CC,GG,TT,CC
101953642,39,102440055,102407785,M,CG,GG,AA,CT,AA,AG,GG,GG,CT,AG,CT,GG,CC,GG,CC,TT,AA,AC,CC,CT,GG,XX,CT,GG,AG,AG,XX,AG,CT,AG,TT,GG,II,CT,AA,CC,CC,GG,AA,GG,TT,XX,AT,CC,AG,XX,TT,AA,CG,CT,TT,AG,GG,CC,CT,GG,CC,GG,AA,CC,AG,CC,TT,CC,CC,AG,CT,AC
102407785,39,,,M,GG,GG,AA,TT,AA,AA,GG,GT,CT,AA,CC,GG,CC,GG,CC,TT,AA,CC,CC,XX,GG,TT,CC,GG,GG,AG,AG,AG,TT,AA,TT,GG,II,CT,AA,CC,CC,GG,AA,GG,CT,TT,AT,CC,AG,AG,CT,AA,CC,CT,TT,GG,CG,CC,CT,GG,CC,GG,AA,CC,GG,TT,TT,TT,CC,AG,CT,AC
102440055,39,,,F,CG,GG,AA,CT,AA,GG,GG,GG,CT,GG,TT,AG,CC,GG,CC,TT,AA,AA,CC,CT,GT,CT,TT,GG,AG,GG,AA,GG,CC,GG,TT,GG,II,TT,AA,CC,CC,GG,AT,GG,CT,TT,AT,CT,AG,AG,TT,AA,GG,CT,TT,AG,GG,CC,CC,GG,CC,GG,AA,CC,AA,CT,TT,CC,CC,GG,TT,CC
102489482,50,102655766,102542372,M,GG,XX,AG,XX,AT,XX,AG,GG,CC,AA,TT,AG,CC,GG,XX,TT,XX,AA,CC,TT,GG,CT,CT,XX,GG,AG,AG,XX,CC,XX,TT,GG,II,XX,AG,XX,CC,XX,AA,XX,XX,TT,TT,CC,AA,AA,CC,XX,XX,CC,XX,XX,GG,CC,CC,XX,XX,GG,AA,CC,AG,TT,TT,TT,CC,AG,CT,AC
102542372,50,,,M,CG,XX,AA,TT,AA,XX,AG,GG,CC,AA,TT,AG,CC,XX,XX,XX,XX,XX,XX,TT,XX,CT,XX,GG,GG,GG,AA,XX,CC,XX,TT,GG,II,XX,XX,XX,CC,XX,AA,XX,XX,TT,AT,CT,AG,AA,CC,XX,XX,CT,XX,XX,GG,CC,CC,XX,XX,GG,AA,XX,AA,TT,TT,TT,CC,AG,CT,AC
102655766,50,,,F,GG,XX,GG,CC,AT,XX,GG,GG,CC,AA,TT,AA,CT,XX,XX,XX,XX,XX,XX,TT,XX,TT,XX,GG,GG,AG,AG,XX,CT,XX,TT,GG,II,XX,XX,XX,CC,XX,AA,XX,XX,TT,TT,CC,AA,AA,CC,XX,XX,CC,XX,XX,GG,CC,CC,XX,XX,GG,AA,XX,AG,CT,TT,CT,CC,GG,TT,CC
102888447,55,103206176,102954721,M,GG,XX,AA,CT,AA,XX,AA,GT,CC,AG,CT,AG,CC,GG,XX,TT,XX,AC,CC,TT,GT,TT,CT,XX,GG,AG,AG,XX,CT,XX,GT,GG,II,XX,AA,XX,CC,XX,AA,XX,XX,TT,TT,CC,AG,AG,CT,XX,XX,TT,XX,XX,GG,CC,CT,XX,XX,GG,AA,CC,AG,CC,TT,TT,CC,AG,CT,AC
102954721,55,,,M,CG,GG,AG,CC,AT,AG,AG,GT,CC,AG,TT,AA,CC,GG,CC,TT,AA,CC,CC,CT,XX,CT,TT,GG,AG,GG,AA,AG,CT,GG,TT,GG,II,TT,AA,CC,CA,GG,AT,AG,TT,TT,AT,CT,GG,GG,TT,AG,CC,CT,TT,GG,GG,CC,TT,GT,TT,GG,AA,CC,AA,TT,TT,CC,CC,AG,CT,AC
103206176,55,,,F,GG,GG,AG,CT,AA,AA,AG,GG,CC,GG,CT,AG,CC,GG,CC,TT,AA,AC,CC,TT,XX,CT,TT,GG,GG,GG,AA,AA,CC,AG,GT,GG,II,CC,AA,CC,CC,GG,AT,AG,TT,XX,AT,CT,GG,AG,TT,AG,CG,TT,TT,GG,CG,CC,CC,GT,CT,GG,AG,CC,GG,CT,TT,TT,CC,GG,TT,CC
103285917,58,103368303,103344741,F,CG,GG,AA,TT,AA,AG,GG,GT,CT,AG,TT,AG,CC,GG,CC,TT,AC,AA,CT,TT,GT,CT,TT,GG,AG,GG,AA,AG,TT,AG,TT,GG,II,CC,AA,CC,CC,GG,AA,GG,TT,TT,AT,CC,AG,AA,TT,AA,CC,TT,TT,GG,GG,CC,CC,GT,CT,GG,AA,CC,AG,CC,TT,TT,CC,GG,TT,CC
103344741,58,,,M,GG,GG,AG,TT,AA,AA,GG,GT,CT,GG,TT,GG,CC,GG,CC,TT,AA,AA,CT,TT,GT,CT,TT,GG,GG,GG,AA,AA,TT,AG,TT,GG,II,CT,AG,CC,CC,GG,AA,GG,CT,TT,AA,CT,GG,AA,TT,AA,CC,TT,TT,GG,GG,CC,CT,GG,CC,GG,AA,CC,AG,CC,TT,TT,CC,AG,CT,AC
103368303,58,,,F,CG,GG,AA,TT,AA,AG,GG,GT,CC,AA,CT,AG,CC,GG,CC,TT,CC,AC,CT,TT,GT,CT,TT,GG,AG,GG,AA,AG,CT,AG,TT,GG,II,CC,AA,CC,CC,GG,AA,GG,TT,TT,TT,CC,AG,AG,TT,AA,CC,CT,TT,GG,GG,CC,CC,GT,CT,GG,AA,CT,AA,CT,TT,CT,CC,GG,TT,CC
103421049,59,103617857,103474092,M,CG,GG,AG,CT,AA,AG,AG,GG,CC,AG,TT,AA,CC,GG,CC,TT,CC,AA,CC,TT,GT,TT,CT,AG,GG,AG,AG,AG,CT,GG,TT,GG,II,CT,AA,CC,CC,GG,AA,GG,CT,TT,TT,CC,AA,AA,TT,AA,CG,CC,TT,GG,GG,CC,CC,GT,CT,GG,AA,CT,AA,CC,TT,CC,CC,AG,CT,AC
103474092,59,,,M,CG,GG,GG,CC,AT,GG,GG,GG,CC,AG,TT,AG,CC,GG,CC,CT,CC,AC,CT,TT,GT,TT,CT,AG,GG,AG,AG,GG,CC,GG,TT,GG,II,CT,AA,CC,CC,GG,AA,AG,TT,TT,AT,CC,AA,AA,TT,AA,CG,CC,TT,AG,GG,CC,CC,GG,CC,GG,AA,CT,AA,TT,TT,CC,CC,AG,CT,AC
103617857,59,,,F,CG,GG,AA,CT,AA,AG,AG,GG,CC,AG,CT,AA,CC,GG,CC,TT,AC,AC,CC,TT,TT,TT,TT,GG,GG,GG,AA,AG,TT,GG,TT,GG,II,TT,AA,CC,CC,GG,AA,GG,CT,XX,TT,CC,AA,AA,CT,AA,CC,CC,TT,GG,GG,CC,CT,GT,CT,GG,AA,CC,AA,CT,CT,CT,CC,GG,TT,CC
103687006,60,104118106,103950433,F,CG,GG,GG,CT,AT,AG,AG,GT,CT,AG,CT,AG,CC,GG,CC,TT,CC,CC,CC,CT,GG,CT,TT,GG,GG,GG,AA,AA,CT,AG,TT,GG,II,TT,AA,CC,CC,GG,AA,AA,CT,TT,TT,CC,AA,AA,TT,AA,GG,TT,TT,GG,CG,CC,CT,GT,CT,GG,AA,CC,AA,TT,CT,TT,CC,GG,TT,CC
103950433,60,,,M,GG,GG,AG,TT,AA,AG,AG,GG,CC,AG,TT,AA,CC,GG,CC,TT,AC,AC,CC,CC,GG,CC,TT,GG,GG,GG,AA,AA,CT,GG,TT,GG,II,TT,AG,CC,CC,GG,AA,AA,CT,XX,TT,CC,AA,AA,CT,AA,CG,TT,TT,GG,CG,CC,CC,GT,CT,GG,AA,CC,AA,TT,CC,TT,CC,AG,CT,AC
104118106,60,,,F,CC,GG,GG,CC,TT,AA,AG,GT,CT,GG,CT,GG,CC,GG,CC,TT,AC,CC,CC,TT,GG,CT,TT,GG,GG,GG,AA,AA,CC,AA,TT,GG,II,TT,AA,CC,CC,GG,AA,AG,CT,TT,TT,CC,AA,AA,TT,AG,CG,TT,TT,AG,GG,CC,CT,GT,CT,GG,AA,CC,AA,TT,TT,TT,CC,GG,TT,CC
104137597,61,104280038,104269807,F,GG,XX,GG,CT,AT,XX,AG,GG,CC,AA,CT,AA,CC,XX,XX,XX,XX,CC,XX,CT,GG,CC,TT,GG,AG,GG,AA,XX,CT,XX,TT,GG,II,CT,XX,XX,CC,XX,AA,XX,XX,CT,AT,CC,AA,AA,CT,AA,CC,TT,CT,XX,GG,CC,CT,XX,XX,GG,AG,CC,AG,CT,TT,TT,CC,GG,TT,CC
104269807,61,,,M,GG,XX,AG,TT,AA,XX,AG,GG,CC,AG,CT,AG,CC,XX,XX,XX,XX,CC,XX,TT,GG,CC,TT,GG,AG,GG,AA,XX,TT,XX,TT,GG,II,CT,XX,XX,CC,XX,AA,XX,XX,TT,TT,CC,AA,AA,CC,AA,CC,TT,CT,XX,GG,CC,CC,XX,XX,GG,AA,CT,AA,CC,TT,TT,CC,XX,CT,AC
104280038,61,,,F,CG,XX,AG,CT,AT,XX,GG,GG,CC,AG,CC,AG,CC,XX,XX,XX,XX,CC,XX,CT,GT,CT,TT,GG,GG,XX,AA,XX,CC,XX,TT,GG,II,CT,XX,XX,AC,XX,AA,XX,XX,CT,AT,CC,AA,AA,TT,AA,CC,TT,TT,XX,GG,CC,CT,XX,XX,GG,AG,CT,GG,CT,TT,TT,CC,GG,TT,CC
104480851,63,,,F,GG,XX,AA,TT,AA,XX,GG,GT,CT,AA,TT,AA,CC,GG,XX,TT,XX,CC,CC,TT,GG,CT,CT,GG,AG,GG,AA,XX,CT,XX,TT,GG,II,XX,AA,XX,AC,XX,AA,XX,XX,TT,TT,CC,AG,AG,TT,XX,XX,CT,XX,XX,GG,CC,CT,XX,XX,GG,AG,CC,GG,TT,TT,TT,CC,GG,TT,CC
104500961,64,104551957,104524442,F,GG,GG,AA,TT,AA,AG,AG,GG,CC,AA,TT,GG,CC,GG,CC,TT,AC,AC,CT,TT,TT,TT,TT,GG,GG,GG,AA,AG,CC,AA,TT,GG,II,CT,AA,CC,AA,GG,AA,GG,TT,CT,AA,CT,AG,AA,TT,AA,CC,CT,TT,GG,GG,CC,TT,GG,CC,GG,AA,CC,AG,TT,TT,CT,CC,GG,TT,CC
104524442,64,,,M,CC,GG,AG,CC,AT,AA,AG,GT,CT,GG,CC,GG,CC,GG,CC,TT,CC,AA,CC,TT,GT,TT,CT,AG,GG,AG,AG,GG,CC,GG,TT,GG,II,CC,AA,CC,CC,GG,AT,GG,CT,TT,AT,CC,AG,AG,TT,AA,CC,TT,TT,AG,GG,CC,CC,GT,CT,GG,AA,CC,AA,TT,TT,CC,CC,AG,CT,AC
104551957,64,,,F,GG,GG,AG,CT,AA,AG,AG,GG,CC,AA,TT,AG,CC,GG,CC,TT,CC,AA,CC,CT,GT,TT,CT,GG,GG,AG,AG,AG,CC,AA,TT,GG,II,TT,AG,CC,AC,GG,AA,AG,TT,TT,AT,CT,GG,AG,TT,AA,CC,CT,TT,GG,GG,CC,TT,GG,CC,GG,AA,CC,AA,CT,TT,CT,CC,GG,TT,CC
104597606,65,104743324,104603069,F,CG,GG,AG,TT,AA,GG,GG,GG,CC,AG,TT,AA,CC,GG,CC,TT,CC,CC,CC,TT,GG,CT,CT,GG,AG,GG,AA,AA,CC,AA,TT,GG,II,CT,AA,CC,AC,GG,AA,AA,CC,TT,TT,CC,AA,AA,CT,AA,CG,CT,TT,GG,GG,CT,CT,GT,CT,GG,AA,CC,AA,CC,TT,CT,CC,GG,TT,CC
104603069,65,,,M,CG,GG,AG,TT,AT,AA,GG,GG,CC,AG,CT,AA,CC,GG,CC,CT,AA,AC,CC,CT,GT,CT,TT,GG,AG,GG,AA,AA,CT,GG,GT,GG,II,TT,AA,CC,CC,GG,AA,AG,TT,TT,AA,CT,AG,AG,TT,AA,CC,CT,TT,GG,GG,CC,CT,TT,CT,GG,AG,CT,AA,CC,TT,TT,CC,AG,CT,AC
104743324,65,,,F,GG,GG,GG,CT,AT,AG,GG,GT,CC,XX,TT,AG,CC,GG,CC,TT,CC,AC,CC,CT,GG,TT,CT,GG,GG,GG,AG,AG,CT,AA,TT,GG,II,CC,AA,CC,CC,GG,AT,AG,CC,TT,TT,CC,AA,AA,TT,AA,CC,CC,TT,GG,GG,CT,CC,GT,CT,GG,AA,CC,AG,CT,CT,CT,CC,GG,TT,CC
104878295,66,105054132,104888642,M,GG,XX,GG,CC,XX,XX,GG,GG,CC,AA,CT,GG,CC,XX,XX,XX,XX,AC,XX,XX,TT,TT,TT,GG,GG,GG,AA,XX,CC,XX,TT,GG,II,CT,XX,XX,CC,XX,AA,XX,XX,TT,AT,CC,AA,AA,TT,AA,CC,CC,TT,XX,GG,CC,XX,XX,XX,GG,AA,CC,AA,TT,CC,XX,CC,AG,CT,AC
104888642,66,,,M,GG,XX,AG,CT,AT,XX,AG,GG,CC,AA,TT,AG,CC,XX,XX,XX,XX,AC,XX,XX,TT,TT,TT,GG,GG,GG,AA,XX,CT,XX,TT,GG,II,CC,XX,XX,CC,XX,AA,XX,XX,TT,TT,CC,AA,AA,TT,AG,CG,CC,TT,XX,GG,CT,CT,XX,XX,GG,AG,CC,AG,TT,TT,TT,CC,AG,CT,AC
105054132,66,,,F,CG,XX,AG,CT,AT,XX,GG,GT,CT,AG,CT,GG,CT,XX,XX,XX,XX,CC,XX,XX,GT,CT,TT,GG,GG,GG,AA,XX,CC,XX,TT,GG,II,CT,XX,XX,CC,XX,AA,XX,XX,TT,AA,CT,AG,AG,CT,AA,CC,CT,TT,XX,GG,CC,CT,XX,XX,GG,AG,CT,AG,CT,CT,TT,CC,GG,TT,CC
105054883,67,,,M,CG,GG,AA,TT,AA,AG,AG,GT,CC,AG,TT,AG,CC,GG,CC,TT,AA,AA,CC,CC,GT,TT,CT,AG,GG,AG,AG,AG,CT,AG,TT,GG,II,CT,AA,CC,CC,GG,AA,AG,TT,TT,AA,TT,GG,AG,CT,AG,CC,TT,TT,GG,GG,CC,CT,GG,CC,GG,AG,CC,AG,TT,CC,TT,CC,AG,CT,AC
105264005,78,105499010,105374378,M,CG,XX,AA,CT,AA,XX,GG,GT,CC,AG,TT,AG,CC,XX,XX,XX,XX,AC,XX,CC,GT,CT,TT,GG,AG,GG,AA,XX,CT,XX,TT,GG,II,CT,XX,XX,AA,XX,AA,XX,XX,TT,TT,CC,GG,GG,TT,AG,CC,TT,TT,XX,GG,CT,CT,XX,XX,GG,AA,CT,AG,TT,TT,CC,CC,AG,CT,AC
105374378,78,,,M,CG,XX,AA,TT,AA,XX,GG,GT,CT,GG,CT,AA,CC,XX,XX,XX,XX,AC,XX,CT,GT,TT,TT,GG,GG,GG,AA,XX,CT,XX,TT,GG,II,TT,XX,XX,CC,XX,AA,XX,XX,TT,AA,TT,GG,AG,CC,AG,CG,CC,TT,XX,GG,CC,CC,XX,XX,GG,AA,CC,GG,CC,TT,CC,CC,AG,CT,AC
105499010,78,,,F,CG,XX,AG,CT,AT,XX,GG,GT,CT,GG,CT,GG,CC,XX,XX,XX,XX,CC,XX,CT,GT,TT,CT,AG,GG,AG,AG,XX,CT,XX,TT,GG,II,CT,XX,XX,AC,XX,AA,XX,XX,TT,TT,CC,AG,AG,TT,AA,CC,CT,TT,XX,GG,CC,CT,XX,XX,GG,AA,CT,GG,TT,TT,CT,CC,GG,TT,CC
105689781,79,105957326,105702081,M,CC,GG,GG,CT,AT,GG,GG,GG,CT,GG,TT,GG,CC,GG,CC,TT,AC,AC,CC,CC,GT,CT,TT,GG,GG,GG,AA,AA,TT,AG,TT,GG,II,CT,AA,CC,CC,GG,AA,GG,CT,TT,AT,CC,AG,AG,CT,AG,CC,CT,TT,GG,GG,CC,CT,GG,CC,GG,AA,CC,AA,TT,TT,TT,CC,AG,CT,AC
105702081,79,,,M,CG,GG,GG,CC,TT,AG,GG,GG,CT,GG,TT,GG,CC,GG,CC,TT,AC,AA,CC,CT,GG,CC,TT,GG,GG,GG,AA,AA,CT,GG,TT,GG,II,CC,AG,CC,AC,GG,AA,GG,CT,TT,AT,CC,AG,AG,TT,AG,CG,CC,TT,GG,GG,CC,CT,GG,CC,GG,AA,CC,AA,TT,TT,TT,CC,AG,CT,AC
105957326,79,,,F,CC,GG,AG,TT,AA,AG,GG,GG,CC,GG,CT,AG,CC,GG,CC,TT,AC,CC,CC,CT,GT,TT,TT,GG,GG,GG,AG,AG,CT,AG,TT,GG,II,TT,AA,CC,AC,GG,AA,AG,CC,TT,TT,CC,AA,AA,CT,AA,CC,TT,TT,GG,GG,CC,CC,TT,CT,GG,AA,CC,AA,TT,TT,TT,CC,GG,TT,CC
105991406,81,106346630,106175169,M,CC,XX,GG,CC,TT,XX,GG,GG,CC,AG,TT,AG,CC,XX,XX,XX,XX,AC,XX,CT,GT,CT,TT,GG,GG,GG,AA,XX,CT,XX,TT,GG,II,CT,XX,XX,CC,XX,AA,XX,XX,TT,AT,CC,AG,AA,CT,AA,CC,CC,TT,XX,GG,CC,XX,XX,XX,GG,AA,CC,AA,TT,TT,TT,CC,AG,CT,AC
106175169,81,,,M,CC,XX,AG,CT,AT,XX,GG,GG,CC,AG,TT,AG,CC,XX,XX,XX,XX,CC,XX,TT,GT,CT,TT,GG,AG,GG,AA,XX,CT,XX,TT,CG,II,CT,XX,XX,CC,XX,AA,XX,XX,TT,AT,CT,AG,AG,TT,AA,CC,CT,TT,XX,GG,CC,CT,XX,XX,GG,AA,CC,AA,CC,TT,TT,CC,AG,CT,AC
106346630,81,,,F,CC,XX,AG,CT,AT,XX,GG,GT,CT,AA,TT,AA,CC,XX,XX,XX,XX,AC,XX,CT,GG,CC,TT,GG,GG,GG,AA,XX,CC,XX,TT,GG,II,CC,XX,XX,CC,XX,AA,XX,XX,TT,AA,CT,GG,AA,CC,AA,CC,CT,TT,XX,GG,CC,CC,XX,XX,GG,AA,CC,AA,CT,TT,XX,CC,GG,TT,CC
106412383,82,,,F,GG,XX,AA,CT,AA,XX,AG,GG,CC,GG,TT,AG,CC,GG,XX,TT,XX,AC,CC,TT,GT,CT,TT,GG,GG,GG,AA,XX,CC,XX,TT,GG,II,XX,AA,XX,CC,XX,TT,XX,XX,TT,AT,CT,AG,AG,TT,XX,XX,TT,XX,XX,GG,CC,CT,XX,XX,GG,AA,CC,AA,CT,TT,CC,CC,GG,TT,CC
106492861,85,106704130,106612329,F,CG,GG,AG,CT,AT,AG,AG,GG,CC,GG,CT,AG,CC,GG,CC,TT,AC,AA,CC,TT,XX,XX,TT,GG,GG,GG,AA,AA,CT,AA,TT,GG,II,CT,AA,CC,AC,GG,AA,GG,CC,TT,AT,CC,AG,AA,CT,AA,CC,CC,TT,GG,CG,CC,CC,GT,CT,GG,AA,CC,AG,CC,TT,CT,CC,GG,TT,CC
106612329,85,,,M,CC,GG,AA,TT,AA,AG,GG,GG,CC,AG,CT,AG,CC,GG,CC,TT,AC,AC,CC,TT,TT,TT,TT,GG,GG,GG,AA,AA,TT,AA,TT,GG,II,CT,AA,CC,AC,GG,AA,AG,CC,TT,AA,CC,AG,AA,CT,AA,CC,CC,TT,GG,CG,CC,CC,GT,CT,GG,AA,CC,AA,CC,TT,TT,CC,AG,CT,AC
106704130,85,,,F,GG,GG,GG,CC,TT,AG,AG,GG,CC,GG,TT,GG,CC,GG,CC,TT,AC,AC,CC,CT,GG,CC,TT,GG,AG,GG,AA,AG,CC,AG,TT,GG,II,CT,AA,CC,CC,GG,AA,AG,CT,TT,TT,CC,AA,AA,CT,AA,CC,CT,TT,GG,GG,CC,CT,TT,TT,GG,AA,CC,GG,CT,CT,CT,CC,GG,TT,CC
106809260,86,107118131,106821533,M,CG,XX,AG,XX,AA,XX,GG,GG,CC,AG,CT,GG,CC,XX,XX,XX,XX,CC,XX,TT,GT,CT,TT,GG,GG,GG,AA,XX,CT,XX,TT,GG,II,CT,XX,XX,AC,XX,AA,XX,XX,TT,TT,CC,AG,AG,CT,AA,CC,TT,TT,XX,GG,CC,CT,XX,XX,GG,AA,CT,GG,TT,CC,TT,CC,AG,XX,AC
106821533,86,,,M,CG,XX,AG,CT,AA,XX,GG,GG,CC,GG,TT,AG,CC,XX,XX,XX,XX,AC,XX,TT,GT,CT,TT,GG,GG,GG,AA,XX,CC,XX,TT,GG,II,TT,XX,XX,AC,XX,AA,XX,XX,TT,TT,CC,GG,GG,CT,AA,CC,CT,TT,XX,GG,CC,CT,XX,XX,GG,AA,TT,GG,TT,TT,TT,CC,AG,CT,AC
107118131,86,,,F,CG,XX,AA,TT,AA,XX,GG,GG,CC,AG,CT,GG,CC,XX,XX,XX,XX,AC,XX,TT,TT,TT,TT,GG,GG,GG,AA,XX,CT,XX,TT,GG,II,CC,XX,XX,CC,XX,AA,XX,XX,TT,TT,CC,AG,AG,CT,AA,CC,CT,TT,XX,GG,CC,CC,XX,XX,GG,AA,CT,AG,TT,CT,TT,CC,GG,TT,CC
107186680,87,107261731,107238650, ,CC,XX,AG,XX,XX,XX,GG,GT,CC,XX,XX,AG,CC,XX,XX,XX,XX,AC,XX,CT,TT,TT,TT,GG,GG,GG,AA,XX,CC,XX,TT,GG,II,TT,XX,XX,CC,XX,AA,XX,XX,TT,TT,CC,AA,AA,CT,AA,CC,CT,TT,XX,GG,CC,CT,XX,XX,GG,AA,CC,AG,XX,TT,XX,CC,AG,CT,AC
107238650,87,,,M,CC,XX,GG,CC,TT,XX,AG,GG,CC,GG,CT,GG,CC,XX,XX,XX,XX,XX,XX,TT,TT,TT,TT,GG,GG,GG,AA,XX,CT,XX,TT,GG,II,TT,XX,XX,AC,XX,AA,XX,XX,TT,TT,CC,AG,AG,CT,AA,CC,CT,TT,XX,GG,CC,XX,XX,XX,GG,AA,CC,GG,CC,TT,CC,TT,AG,CT,AC
107261731,87,,, ,CG,XX,AA,CT,AA,XX,GG,GG,CT,AG,CT,GG,CT,XX,XX,XX,XX,CC,XX,TT,GT,CT,TT,GG,GG,GG,AA,XX,TT,XX,TT,GG,II,CT,XX,XX,AC,XX,AA,XX,XX,TT,TT,CC,AA,AA,TT,GG,CC,CT,TT,XX,GG,CT,CT,XX,XX,GG,AA,CC,AA,CC,TT,TT,CC,AG,CT,AC
107399715,89,107558874,107450828,M,CC,GG,GG,CC,AT,AA,GG,GG,CC,AG,TT,GG,CC,GG,CC,TT,AA,AC,CC,TT,GG,CC,TT,GG,GG,GG,AA,AG,TT,GG,TT,GG,II,TT,AA,CC,CC,GG,AA,AG,CT,TT,AT,CT,AG,AG,TT,AA,CC,TT,TT,GG,GG,CC,CT,GT,CC,GG,AA,CC,GG,TT,TT,TT,CC,AG,CT,AC
107450828,89,,,M,CG,GG,AA,CT,AA,AA,GG,TT,CT,AG,TT,GG,CC,GG,CC,TT,CC,CC,CT,CT,GT,TT,CT,GG,GG,AG,AG,GG,TT,AG,TT,GG,II,TT,AG,CC,CC,GG,AA,AA,CT,TT,AT,CT,GG,GG,TT,AA,CC,CT,TT,GG,CG,CC,CC,GT,CT,GG,AG,CC,AG,TT,TT,TT,CC,AG,CT,AC
107558874,89,,,F,CG,GG,AG,CT,AT,AA,GG,GG,CC,AG,TT,AG,CC,GG,CC,TT,AC,AA,CC,TT,GT,CT,TT,GG,GG,GG,AA,GG,CT,GG,TT,GG,II,CT,AA,CC,CC,GG,AA,AG,TT,TT,AT,CT,AG,AA,TT,AA,CC,TT,TT,GG,GG,CC,CT,GT,CT,GG,AG,CC,AG,CT,TT,TT,CC,GG,TT,CC
107867487,90,108289249,107888208,F,GG,XX,AG,CT,AT,XX,AG,GG,CC,AA,CT,AA,CC,GG,XX,TT,XX,AA,CC,TT,TT,TT,TT,XX,GG,GG,AA,XX,CT,XX,TT,GG,II,XX,AA,XX,AC,XX,AA,XX,XX,TT,TT,CC,AA,AA,TT,XX,XX,CT,XX,XX,GG,CT,CT,XX,XX,GG,AA,CC,GG,TT,CT,CT,CC,GG,TT,CC
107888208,90,,,M,GG,XX,AA,TT,AA,XX,AG,GG,CT,AG,CT,AA,CC,XX,XX,XX,XX,XX,XX,TT,XX,TT,CT,AG,GG,AG,AG,XX,CT,XX,TT,GG,II,XX,XX,XX,CC,XX,AA,XX,XX,TT,AT,CT,AG,AG,CT,XX,XX,TT,XX,XX,GG,CC,CT,XX,XX,GG,AA,XX,GG,TT,TT,CC,CC,AG,CT,AC
108289249,90,,,F,GG,XX,AG,CT,AT,XX,GG,GG,CC,AG,TT,AG,CC,XX,XX,XX,XX,XX,XX,TT,XX,TT,TT,GG,GG,GG,AA,XX,CC,XX,TT,GG,II,XX,XX,XX,AC,XX,AA,XX,XX,TT,TT,CC,AA,AA,TT,XX,XX,CT,XX,XX,GG,CT,CC,XX,XX,GG,AA,XX,GG,TT,CT,CT,CC,GG,TT,CC
108357494,92,108403695,108395385,M,CG,GG,AG,CC,AT,AG,AG,GG,CC,AG,TT,AG,CC,GG,CC,TT,CC,CC,CT,CT,GT,CT,TT,GG,GG,GG,AA,AG,CT,AG,TT,GG,II,TT,AG,CC,AC,GG,AA,AG,CT,TT,AT,CC,AG,AG,TT,AG,CC,CC,TT,GG,CG,CT,CC,GT,CT,GG,AA,CC,GG,TT,TT,TT,CC,AG,CT,AC
108395385,92,,,M,CG,GG,AA,CT,AA,AA,AG,GT,CT,AA,TT,GG,CC,GG,CC,TT,AC,AC,TT,CC,GG,CT,CT,GG,GG,AG,AG,AA,TT,AG,TT,GG,II,TT,AG,CC,AC,GG,AA,GG,CC,TT,AT,CT,GG,GG,TT,AG,CC,CT,TT,GG,CG,CC,CC,GG,CC,GG,AA,CC,AG,TT,CC,CC,CC,AG,CT,AC
108403695,92,,,F,GG,GG,GG,CC,TT,AG,GG,GT,CC,AG,CT,AA,CC,GG,CC,TT,CC,CC,CC,CT,TT,TT,TT,GG,GG,GG,AA,GG,CT,AG,TT,GG,II,CT,AA,CC,AC,GG,AA,AG,TT,TT,AT,CC,AA,AA,TT,AA,CC,CC,TT,GG,GG,CT,CT,GT,CT,GG,AA,CC,GG,TT,TT,CT,CC,GG,TT,CC
108567004,93,108801580,108755730,F,CC,XX,AG,CT,AT,XX,GG,GT,CC,AG,TT,AG,CC,XX,XX,XX,XX,XX,XX,TT,XX,CT,TT,GG,GG,GG,AA,XX,CT,XX,TT,GG,II,XX,XX,XX,AC,XX,AA,XX,XX,TT,AT,CT,AG,AG,TT,XX,XX,CC,XX,XX,GG,CC,CC,XX,XX,GG,AA,XX,AA,TT,TT,TT,CC,GG,TT,CC
108755730,93,,,M,CC,XX,AA,TT,AA,XX,AG,GT,CC,AA,TT,AG,TT,XX,XX,XX,XX,XX,XX,CT,XX,TT,TT,GG,GG,GG,GG,XX,CT,XX,TT,GG,II,XX,XX,XX,AC,XX,AA,XX,XX,TT,AT,CT,AG,AG,TT,XX,XX,CC,XX,XX,GG,CC,CT,XX,XX,GG,AG,XX,AG,TT,TT,TT,CC,AG,CT,AC
108801580,93,,,F,CG,XX,AA,CT,AA,XX,GG,GT,CC,AG,CT,AG,CC,XX,XX,XX,XX,XX,XX,CT,XX,CT,TT,GG,GG,GG,AA,XX,CT,XX,TT,GG,II,XX,XX,XX,AC,XX,AA,XX,XX,TT,AT,CT,AG,AA,TT,XX,XX,CT,XX,XX,GG,CC,CC,XX,XX,GG,AA,XX,AA,TT,TT,TT,CC,GG,TT,CC
109061068,95,109229003,109127180,M,GG,GG,GG,CC,TT,GG,GG,GT,CC,AG,CT,AA,CC,GG,CC,TT,CC,CC,CC,CT,GG,TT,CC,GG,GG,AG,AG,GG,TT,GG,TT,GG,II,TT,AA,CC,AC,GG,AA,AG,CT,TT,AT,CT,AG,AG,CT,AA,CC,TT,TT,GG,GG,CC,CT,GT,CT,GG,AA,CC,GG,TT,TT,TT,CC,AG,CT,AC
109127180,95,,,M,CG,GG,GG,CC,TT,GG,GG,TT,CC,AG,TT,AA,CC,GG,CC,TT,AC,CC,CC,CT,GG,CT,CT,GG,AG,AG,AG,GG,CT,GG,TT,GG,II,CT,AA,CC,AC,GG,AA,GG,TT,TT,AA,CT,AG,AG,TT,AA,CC,CT,TT,GG,GG,CC,CT,GG,CC,GG,AA,CC,GG,CC,TT,CC,CC,AG,CT,AC
109229003,95,,,F,GG,GG,AG,CC,AT,GG,GG,GG,CC,AA,CT,AG,CC,GG,CC,TT,CC,CC,CC,TT,GG,TT,CC,GG,GG,GG,AA,AG,CT,GG,TT,GG,II,TT,AA,CC,CC,GG,AA,AG,CT,TT,AT,CT,AG,AG,CT,AA,CG,CT,TT,GG,GG,CC,CC,XX,TT,GG,AG,CC,AG,CT,TT,TT,CC,GG,TT,CC
109234710,98,109321285,109235874,F,CG,GG,AA,TT,AA,AG,AG,GT,CC,AA,TT,AG,CT,GG,CC,CT,AC,AC,CT,TT,GT,CT,TT,GG,AG,GG,AA,AA,CT,GG,TT,GG,II,TT,AA,CC,CC,GG,AA,AA,TT,TT,AT,CT,AG,AA,TT,AG,CC,TT,TT,AG,GG,CC,CC,TT,TT,GG,AG,CT,AG,TT,TT,CT,CC,GG,TT,CC
109235874,98,,,M,GG,GG,AG,CT,AT,AG,GG,GT,CT,AG,CT,AA,CC,GG,CC,CT,AA,AC,CT,CT,GG,CC,TT,GG,AG,GG,AA,AA,CT,AG,TT,GG,II,TT,AA,CC,CC,GG,AA,AA,TT,TT,AT,CC,AG,AA,TT,AG,CC,CT,TT,AG,GG,CC,CC,GT,CT,GG,GG,CT,AG,TT,TT,TT,CC,AG,CT,AC
109321285,98,,,F,CG,GG,AG,TT,AA,AA,AG,TT,CC,AG,TT,AG,CT,GG,CC,TT,AC,AC,CC,CT,GT,TT,TT,GG,GG,GG,AA,AA,TT,AG,TT,GG,II,CT,AA,CC,CC,GG,AA,AG,CT,TT,AT,CT,AG,AA,CT,AG,CC,TT,TT,GG,GG,CC,CC,TT,TT,GG,AA,CT,GG,CT,TT,CC,CC,GG,TT,CC
109356603,101,109680125,109623314,M,CG,GG,GG,TT,AA,AA,GG,GG,CC,AG,CT,AG,CC,GG,CC,TT,AA,AC,CC,TT,TT,TT,TT,GG,GG,GG,AA,AA,CT,GG,TT,GG,II,CC,AA,CC,AC,GG,AA,AG,TT,TT,TT,CC,AA,AA,TT,AA,CC,TT,TT,GG,GG,CC,CC,TT,TT,GG,AA,TT,GG,TT,TT,TT,CC,AG,CT,AC
109623314,101,,,M,CG,GG,AG,TT,AA,AG,GG,GG,CC,AG,TT,AG,CC,GG,CC,TT,AC,CC,CC,CT,GT,CT,TT,GG,GG,GG,AA,AA,CT,GG,TT,GG,II,CT,AA,CC,AC,GG,AA,AG,TT,TT,TT,CC,AA,AA,TT,AA,CG,TT,TT,GG,GG,CC,CC,GT,CT,GG,AA,CT,AG,TT,TT,TT,CC,AG,CT,AC
109680125,101,,,F,CG,GG,AG,TT,AA,AA,GG,GT,CT,AG,CT,AA,CC,GG,CC,TT,AC,AA,CC,CT,TT,TT,TT,GG,GG,GG,AA,AG,CC,GG,TT,GG,II,CT,AA,CC,CC,GG,AA,AA,TT,TT,TT,CC,AG,AG,TT,AA,CC,TT,TT,GG,GG,CC,CC,GT,CT,GG,AA,CT,AG,TT,CT,CT,CC,GG,TT,CC
109703947,102,,,M,CC,XX,AG,CT,AT,XX,AG,GT,CC,AA,CC,AG,CC,GG,XX,TT,XX,CC,CC,TT,GG,CT,CT,AG,GG,AG,AG,XX,CC,XX,TT,GG,II,XX,AA,XX,CC,XX,AA,XX,XX,TT,AA,CC,AA,AA,TT,XX,XX,CT,XX,XX,CG,CC,CC,XX,XX,GG,AA,CC,GG,CC,TT,CC,CC,AG,CT,AC
109750529,103,,,F,CG,XX,AG,XX,AA,XX,GG,GG,CC,AG,TT,AA,CT,GG,XX,TT,XX,CC,CC,TT,GT,TT,CT,GG,GG,AG,AG,XX,CC,XX,TT,GG,II,XX,AA,XX,CC,XX,AA,XX,XX,TT,AA,CT,AG,AG,TT,XX,XX,CC,XX,XX,GG,CC,TT,XX,XX,GG,AA,CC,AA,CT,TT,TT,CC,GG,TT,CC